Reaction Details
TargetVascular endothelial growth factor receptor 2
LigandBDBM50129840
Substrate/Competitorn/a
Meas. Tech.ChEMBL_1524115 (CHEMBL3631056)
IC50 600±n/a nM
Citation Ravez, SArsenlis, SBarczyk, ADupont, AFrédérick, RHesse, SKirsch, GDepreux, PGoossens, L Synthesis and biological evaluation of di-aryl urea derivatives as c-Kit inhibitors. Bioorg Med Chem23:7340-7 (2015) 
 
Vascular endothelial growth factor receptor 2
Name:Vascular endothelial growth factor receptor 2
Type:Receptor Tyrosine Kinase
Mol. Mass.:151510.97
Organism:Homo sapiens (Human)
Description:P35968
Residue:1356
BDBM50129840
NameBDBM50129840
Synonyms:CHEMBL3628803
TypeSmall organic molecule
Emp. Form.C20H21N3O5
Mol. Mass.383.3978
SMILESCCOC(=O)Nc1ccc(Oc2ncnc3cc(OC)c(OC)cc23)cc1C