Reaction Details
TargetVascular endothelial growth factor receptor 2
LigandBDBM50129823
Substrate/Competitorn/a
Meas. Tech.ChEMBL_1524115 (CHEMBL3631056)
IC50>10000±n/a nM
Citation Ravez, SArsenlis, SBarczyk, ADupont, AFrédérick, RHesse, SKirsch, GDepreux, PGoossens, L Synthesis and biological evaluation of di-aryl urea derivatives as c-Kit inhibitors. Bioorg Med Chem23:7340-7 (2015) 
 
Vascular endothelial growth factor receptor 2
Name:Vascular endothelial growth factor receptor 2
Type:Receptor Tyrosine Kinase
Mol. Mass.:151510.97
Organism:Homo sapiens (Human)
Description:P35968
Residue:1356
BDBM50129823
NameBDBM50129823
Synonyms:CHEMBL3628791
TypeSmall organic molecule
Emp. Form.C12H7ClFN3S
Mol. Mass.279.72
SMILESFc1ccc(Nc2ncnc3sccc23)cc1Cl