Reaction Details
TargetEpidermal growth factor receptor
LigandBDBM50129841
Substrate/Competitorn/a
Meas. Tech.ChEMBL_1524114 (CHEMBL3631055)
IC50 1260±n/a nM
Citation Ravez, SArsenlis, SBarczyk, ADupont, AFrédérick, RHesse, SKirsch, GDepreux, PGoossens, L Synthesis and biological evaluation of di-aryl urea derivatives as c-Kit inhibitors. Bioorg Med Chem23:7340-7 (2015) 
 
Epidermal growth factor receptor
Name:Epidermal growth factor receptor
Type:Receptor Kinase Domain
Mol. Mass.:134279.59
Organism:Homo sapiens (Human)
Description:P00533
Residue:1210
BDBM50129841
NameBDBM50129841
Synonyms:CHEMBL3628907
TypeSmall organic molecule
Emp. Form.C23H18BrClN4O2S
Mol. Mass.529.837
SMILESClc1cc(Oc2ncnc3sc4CCCCc4c23)ccc1NC(=O)Nc1cccc(Br)c1