Reaction Details
TargetCruzipain
LigandBDBM50114653
Substrate/Competitorn/a
Meas. Tech.ChEMBL_1524425 (CHEMBL3632433)
IC50 50±n/a nM
Citation de Oliveira Filho, GBde Oliveira Cardoso, MVEspíndola, JWFerreira, LFde Simone, CAFerreira, RSCoelho, PLMeira, CSMagalhaes Moreira, DRSoares, MBLima Leite, AC Structural design, synthesis and pharmacological evaluation of 4-thiazolidinones against Trypanosoma cruzi. Bioorg Med Chem23:7478-86 (2015) 
 
Cruzipain
Name:Cruzipain
Type:Protein
Mol. Mass.:49831.41
Organism:Trypanosoma cruzi
Description:P25779
Residue:467
BDBM50114653
NameBDBM50114653
Synonyms:(1E)-1-(3,4-dichlorophenyl)ethan-1-one thiosemicarbazone | CHEMBL90512
TypeSmall organic molecule
Emp. Form.C9H9Cl2N3S
Mol. Mass.262.159
SMILESCC(=NNC(N)=S)c1ccc(Cl)c(Cl)c1