Reaction Details
Target5-hydroxytryptamine receptor 1D
LigandBDBM50065419
Substrate/Competitorn/a
Meas. Tech.ChEMBL_1525150 (CHEMBL3635488)
IC50 0.300000±n/a nM
Citation Gillis, EPEastman, KJHill, MDDonnelly, DJMeanwell, NA Applications of Fluorine in Medicinal Chemistry. J Med Chem58:8315-59 (2015) 
 
5-hydroxytryptamine receptor 1D
Name:5-hydroxytryptamine receptor 1D
Type:G Protein-Coupled Receptor (GPCR)
Mol. Mass.:41920.63
Organism:Homo sapiens (Human)
Description:Receptor binding assays were performed using human clone stably expressed in CHO cells.
Residue:377
BDBM50065419
NameBDBM50065419
Synonyms:3-[3-(4-Benzyl-piperidin-1-yl)-propyl]-5-[1,2,4]triazol-4-yl-1H-indole | CHEMBL294547
TypeSmall organic molecule
Emp. Form.C25H29N5
Mol. Mass.399.5313
SMILESC(CN1CCC(Cc2ccccc2)CC1)Cc1c[nH]c2ccc(cc12)-n1cnnc1