Reaction Details
Target5-hydroxytryptamine receptor 1D
LigandBDBM50065417
Substrate/Competitorn/a
Meas. Tech.ChEMBL_1525150 (CHEMBL3635488)
IC50 0.900000±n/a nM
Citation Gillis, EPEastman, KJHill, MDDonnelly, DJMeanwell, NA Applications of Fluorine in Medicinal Chemistry. J Med Chem58:8315-59 (2015) 
 
5-hydroxytryptamine receptor 1D
Name:5-hydroxytryptamine receptor 1D
Type:G Protein-Coupled Receptor (GPCR)
Mol. Mass.:41920.63
Organism:Homo sapiens (Human)
Description:Receptor binding assays were performed using human clone stably expressed in CHO cells.
Residue:377
BDBM50065417
NameBDBM50065417
Synonyms:3-[3-(4-Benzyl-4-fluoro-piperidin-1-yl)-propyl]-5-[1,2,4]triazol-4-yl-1H-indole | CHEMBL294732
TypeSmall organic molecule
Emp. Form.C25H28FN5
Mol. Mass.417.5217
SMILESFC1(Cc2ccccc2)CCN(CCCc2c[nH]c3ccc(cc23)-n2cnnc2)CC1