Reaction Details
Target5-hydroxytryptamine receptor 1B
LigandBDBM50060440
Substrate/Competitorn/a
Meas. Tech.ChEMBL_1525151 (CHEMBL3635489)
IC50 11±n/a nM
Citation Gillis, EPEastman, KJHill, MDDonnelly, DJMeanwell, NA Applications of Fluorine in Medicinal Chemistry. J Med Chem58:8315-59 (2015) 
 
5-hydroxytryptamine receptor 1B
Name:5-hydroxytryptamine receptor 1B
Type:G Protein-Coupled Receptor (GPCR)
Mol. Mass.:43579.17
Organism:Homo sapiens (Human)
Description:Receptor binding assays were performed using human clone stably expressed in CHO cells
Residue:390
BDBM50060440
NameBDBM50060440
Synonyms:3-[3-(4-Benzyl-piperazin-1-yl)-propyl]-5-[1,2,4]triazol-4-yl-1H-indole | CHEMBL65367
TypeSmall organic molecule
Emp. Form.C24H28N6
Mol. Mass.400.5193
SMILESC(CN1CCN(Cc2ccccc2)CC1)Cc1c[nH]c2ccc(cc12)-n1cnnc1