Reaction Details
TargetProthrombin
LigandBDBM50130215
Substrate/Competitorn/a
Meas. Tech.ChEMBL_1525156 (CHEMBL3635494)
Ki 65±n/a nM
Citation Gillis, EPEastman, KJHill, MDDonnelly, DJMeanwell, NA Applications of Fluorine in Medicinal Chemistry. J Med Chem58:8315-59 (2015) 
 
Prothrombin
Name:Prothrombin
Type:Protein
Mol. Mass.:70029.57
Organism:Homo sapiens (Human)
Description:P00734
Residue:622
BDBM50130215
NameBDBM50130215
Synonyms:CHEMBL3632873
TypeSmall organic molecule
Emp. Form.C26H32N4O
Mol. Mass.416.5585
SMILES[H][C@]12C3CCCN3[C@@H](c3ccc(cc3)C(N)=N)[C@@]1([H])C(=O)N(Cc1ccccc1)[C@@H]2C(C)C