Reaction Details
TargetProthrombin
LigandBDBM50123500
Substrate/Competitorn/a
Meas. Tech.ChEMBL_1525158 (CHEMBL3635496)
Ki 1.1±n/a nM
Citation Gillis, EPEastman, KJHill, MDDonnelly, DJMeanwell, NA Applications of Fluorine in Medicinal Chemistry. J Med Chem58:8315-59 (2015) 
 
Prothrombin
Name:Prothrombin
Type:Protein
Mol. Mass.:70029.57
Organism:Homo sapiens (Human)
Description:P00734
Residue:622
BDBM50123500
NameBDBM50123500
Synonyms:CHEMBL143139 | N-(6-Amino-2-methyl-pyridin-3-ylmethyl)-2-[6-methyl-3-(2-methyl-2-phenyl-propylamino)-2-oxo-2H-pyrazin-1-yl]-acetamide
TypeSmall organic molecule
Emp. Form.C24H30N6O2
Mol. Mass.434.534
SMILESCc1nc(N)ccc1CNC(=O)Cn1c(C)cnc(NCC(C)(C)c2ccccc2)c1=O