Reaction Details
TargetDipeptidyl peptidase 4
LigandBDBM50130305
Substrate/Competitorn/a
Meas. Tech.ChEMBL_1525147 (CHEMBL3635485)
IC50 1.5±n/a nM
Citation Gillis, EPEastman, KJHill, MDDonnelly, DJMeanwell, NA Applications of Fluorine in Medicinal Chemistry. J Med Chem58:8315-59 (2015) 
 
Dipeptidyl peptidase 4
Name:Dipeptidyl peptidase 4
Type:Enzyme
Mol. Mass.:88271.01
Organism:Homo sapiens (Human)
Description:P27487
Residue:766
BDBM50130305
NameBDBM50130305
Synonyms:CHEMBL3632864
TypeSmall organic molecule
Emp. Form.C11H19N3O
Mol. Mass.209.2881
SMILESCC[C@@H](C)[C@H](N)C(=O)N1CCC[C@H]1C#N