Reaction Details
TargetCholesteryl ester transfer protein
LigandBDBM50094513
Substrate/Competitorn/a
Meas. Tech.ChEMBL_1525146 (CHEMBL3635484)
IC50 200±n/a nM
Citation Gillis, EPEastman, KJHill, MDDonnelly, DJMeanwell, NA Applications of Fluorine in Medicinal Chemistry. J Med Chem58:8315-59 (2015) 
 
Cholesteryl ester transfer protein
Name:Cholesteryl ester transfer protein
Type:Enzyme
Mol. Mass.:54751.53
Organism:Homo sapiens (Human)
Description:P11597
Residue:493
BDBM50094513
NameBDBM50094513
Synonyms:1,1,1-Trifluoro-3-{(3-phenoxy-phenyl)-[3-(1,1,2,2-tetrafluoro-ethoxy)-benzyl]-amino}-propan-2-ol 3-((3-(1,1,2,2-tetrafluoroethoxy)benzyl)(3-phenoxyphenyl)amino)-1,1,1-trifluoropropan-2-ol | CHEMBL297971
TypeSmall organic molecule
Emp. Form.C24H20F7NO3
Mol. Mass.503.4093
SMILESOC(CN(Cc1cccc(OC(F)(F)C(F)F)c1)c1cccc(Oc2ccccc2)c1)C(F)(F)F