Reaction Details
TargetCholesteryl ester transfer protein
LigandBDBM50101003
Substrate/Competitorn/a
Meas. Tech.ChEMBL_1525146 (CHEMBL3635484)
IC50 1600±n/a nM
Citation Gillis, EPEastman, KJHill, MDDonnelly, DJMeanwell, NA Applications of Fluorine in Medicinal Chemistry. J Med Chem58:8315-59 (2015) 
 
Cholesteryl ester transfer protein
Name:Cholesteryl ester transfer protein
Type:Enzyme
Mol. Mass.:54751.53
Organism:Homo sapiens (Human)
Description:P11597
Residue:493
BDBM50101003
NameBDBM50101003
Synonyms:3-((3-ethoxybenzyl)(3-phenoxyphenyl)amino)-1,1,1-trifluoropropan-2-ol CHEMBL416623
TypeSmall organic molecule
Emp. Form.C24H24F3NO3
Mol. Mass.431.4475
SMILESCCOc1cccc(CN(CC(O)C(F)(F)F)c2cccc(Oc3ccccc3)c2)c1