Reaction Details
TargetCannabinoid receptor 1
LigandBDBM50130306
Substrate/Competitorn/a
Meas. Tech.ChEMBL_1525163 (CHEMBL3635501)
Ki 27±n/a nM
Citation Gillis, EPEastman, KJHill, MDDonnelly, DJMeanwell, NA Applications of Fluorine in Medicinal Chemistry. J Med Chem58:8315-59 (2015) 
 
Cannabinoid receptor 1
Name:Cannabinoid receptor 1
Type:Enzyme
Mol. Mass.:52842.52
Organism:Mus musculus (Mouse)
Description:P47746
Residue:473
BDBM50130306
NameBDBM50130306
Synonyms:CHEMBL3633034
TypeSmall organic molecule
Emp. Form.C24H15Cl3F3N3O
Mol. Mass.524.75
SMILESCc1c(nn(c1-c1ccc(Cl)cc1)-c1cc(Cl)cc(Cl)c1)C(=O)Nc1cccc(c1)C(F)(F)F