Reaction Details
TargetTrypanothione reductase
LigandBDBM50130308
Substrate/Competitorn/a
Meas. Tech.ChEMBL_1525164 (CHEMBL3635502)
Ki 84000±n/a nM
Citation Gillis, EPEastman, KJHill, MDDonnelly, DJMeanwell, NA Applications of Fluorine in Medicinal Chemistry. J Med Chem58:8315-59 (2015) 
 
Trypanothione reductase
Name:Trypanothione reductase
Type:Homodimer; oxidoreductase
Mol. Mass.:53868.26
Organism:Trypanosoma cruzi
Description:n/a
Residue:492
BDBM50130308
NameBDBM50130308
Synonyms:CHEMBL3633036
TypeSmall organic molecule
Emp. Form.C28H35Cl3FN3
Mol. Mass.538.955
SMILES[Cl-].CC(C)(C)c1ccc(Nc2ccc(F)cc2NCCC[N+](C)(C)Cc2ccc(Cl)cc2Cl)cc1