Reaction Details
TargetEndothelin-1 receptor
LigandBDBM50130314
Substrate/Competitorn/a
Meas. Tech.ChEMBL_1525161 (CHEMBL3635499)
IC50 112±n/a nM
Citation Gillis, EPEastman, KJHill, MDDonnelly, DJMeanwell, NA Applications of Fluorine in Medicinal Chemistry. J Med Chem58:8315-59 (2015) 
 
Endothelin-1 receptor
Name:Endothelin-1 receptor
Type:Enzyme Catalytic Domain
Mol. Mass.:48736.88
Organism:Homo sapiens (Human)
Description:P25101
Residue:427
BDBM50130314
NameBDBM50130314
Synonyms:CHEMBL3633040
TypeSmall organic molecule
Emp. Form.C25H22F5N3O6S2
Mol. Mass.619.581
SMILESCOc1ccccc1Oc1c(NS(=O)(=O)c2ccc(cc2)S(F)(F)(F)(F)F)cc(cc1OCCO)-c1ncccn1