Reaction Details
TargetVascular endothelial growth factor receptor 2
LigandBDBM50130407
Substrate/Competitorn/a
Meas. Tech.ChEMBL_1525349 (CHEMBL3636166)
IC50>100000±n/a nM
Citation Vojticková, MDobia?, JHanquet, GAddová, GCetin-Atalay, RYildirim, DCBohác, A Ynamide Click chemistry in development of triazole VEGFR2 TK modulators. Eur J Med Chem103:105-22 (2015) 
 
Vascular endothelial growth factor receptor 2
Name:Vascular endothelial growth factor receptor 2
Type:Receptor Tyrosine Kinase
Mol. Mass.:151510.97
Organism:Homo sapiens (Human)
Description:P35968
Residue:1356
BDBM50130407
NameBDBM50130407
Synonyms:CHEMBL3633695
TypeSmall organic molecule
Emp. Form.C22H21N5O3S
Mol. Mass.435.499
SMILESCCS(=O)(=O)c1ccc(OC)c(Nc2cn(nn2)-c2cccc(c2)-c2cccnc2)c1