Reaction Details
TargetTranslocator protein
LigandBDBM22032
Substrate/Competitorn/a
Meas. Tech.ChEMBL_1525487 (CHEMBL3636685)
IC50 12±n/a nM
Citation Elkamhawy, AViswanath, ANPae, ANKim, HYHeo, JCPark, WKLee, COYang, HKim, KHNam, DHSeol, HJCho, HRoh, EJ Discovery of potent and selective cytotoxic activity of new quinazoline-ureas against TMZ-resistant glioblastoma multiforme (GBM). Eur J Med Chem103:210-22 (2015) 
 
Translocator protein
Name:Translocator protein
Type:Mitochondrion membrane protein
Mol. Mass.:18945.84
Organism:Rattus norvegicus (rat)
Description:Competitive binding experiments were performed on rat kidney mitochondrial membranes.
Residue:169
BDBM22032
NameBDBM22032
Synonyms:1-(2-chlorophenyl)-N-methyl-N-(1-methylpropyl)isoquinoline-3-carboxamide N-(butan-2-yl)-1-(2-chlorophenyl)-N-methylisoquinoline-3-carboxamide PK-11195 RP 52028 | [3H]PK 11195
Typeradiolabeled ligand
Emp. Form.C21H21ClN2O
Mol. Mass.352.857
SMILESCCC(C)N(C)C(=O)c1cc2ccccc2c(n1)-c1ccccc1Cl