Reaction Details
TargetSodium channel protein type 1 subunit alpha
LigandBDBM50130518
Substrate/Competitorn/a
Meas. Tech.ChEMBL_1525512 (CHEMBL3636865)
IC50 4800±n/a nM
Citation Suzuki, SKuroda, TKimoto, HDomon, YKubota, KKitano, YYokoyama, TShimizugawa, ASugita, RKoishi, RAsano, DTamaki, KShinozuka, TKobayashi, H Discovery of (phenoxy-2-hydroxypropyl)piperidines as a novel class of voltage-gated sodium channel 1.7 inhibitors. Bioorg Med Chem Lett25:5419-23 (2015) 
 
Sodium channel protein type 1 subunit alpha
Name:Sodium channel protein type 1 subunit alpha
Type:Protein
Mol. Mass.:228952.47
Organism:Homo sapiens (Human)
Description:P35498
Residue:2009
BDBM50130518
NameBDBM50130518
Synonyms:CHEMBL3634326
TypeSmall organic molecule
Emp. Form.C29H30N2O5
Mol. Mass.486.5589
SMILESOC(COc1ccccc1C(=O)c1ccccc1)CN1CCC(CC1)N1C(=O)COc2ccccc12