Reaction Details
TargetSodium channel protein type 1 subunit alpha
LigandBDBM50130533
Substrate/Competitorn/a
Meas. Tech.ChEMBL_1525512 (CHEMBL3636865)
IC50 910±n/a nM
Citation Suzuki, SKuroda, TKimoto, HDomon, YKubota, KKitano, YYokoyama, TShimizugawa, ASugita, RKoishi, RAsano, DTamaki, KShinozuka, TKobayashi, H Discovery of (phenoxy-2-hydroxypropyl)piperidines as a novel class of voltage-gated sodium channel 1.7 inhibitors. Bioorg Med Chem Lett25:5419-23 (2015) 
 
Sodium channel protein type 1 subunit alpha
Name:Sodium channel protein type 1 subunit alpha
Type:Protein
Mol. Mass.:228952.47
Organism:Homo sapiens (Human)
Description:P35498
Residue:2009
BDBM50130533
NameBDBM50130533
Synonyms:CHEMBL3632693
TypeSmall organic molecule
Emp. Form.C24H27F3N2O4
Mol. Mass.464.4774
SMILESCOc1cc(ccc1OCC(O)CN1CCC(CC1)N1Cc2ccccc2C1=O)C(F)(F)F