Reaction Details
TargetSodium channel protein type 5 subunit alpha
LigandBDBM50130514
Substrate/Competitorn/a
Meas. Tech.ChEMBL_1525513 (CHEMBL3636866)
IC50 18000±n/a nM
Citation Suzuki, SKuroda, TKimoto, HDomon, YKubota, KKitano, YYokoyama, TShimizugawa, ASugita, RKoishi, RAsano, DTamaki, KShinozuka, TKobayashi, H Discovery of (phenoxy-2-hydroxypropyl)piperidines as a novel class of voltage-gated sodium channel 1.7 inhibitors. Bioorg Med Chem Lett25:5419-23 (2015) 
 
Sodium channel protein type 5 subunit alpha
Name:Sodium channel protein type 5 subunit alpha
Type:Enzyme
Mol. Mass.:226908.60
Organism:Homo sapiens (Human)
Description:Q14524
Residue:2016
BDBM50130514
NameBDBM50130514
Synonyms:CHEMBL3634324
TypeSmall organic molecule
Emp. Form.C30H32N2O4
Mol. Mass.484.5861
SMILESOC(COc1ccccc1C(=O)c1ccccc1)CN1CCC(CC1)c1cccc2NC(=O)CCc12