Reaction Details
TargetSodium channel protein type 5 subunit alpha
LigandBDBM50130531
Substrate/Competitorn/a
Meas. Tech.ChEMBL_1525513 (CHEMBL3636866)
IC50 4400±n/a nM
Citation Suzuki, SKuroda, TKimoto, HDomon, YKubota, KKitano, YYokoyama, TShimizugawa, ASugita, RKoishi, RAsano, DTamaki, KShinozuka, TKobayashi, H Discovery of (phenoxy-2-hydroxypropyl)piperidines as a novel class of voltage-gated sodium channel 1.7 inhibitors. Bioorg Med Chem Lett25:5419-23 (2015) 
 
Sodium channel protein type 5 subunit alpha
Name:Sodium channel protein type 5 subunit alpha
Type:Enzyme
Mol. Mass.:226908.60
Organism:Homo sapiens (Human)
Description:Q14524
Residue:2016
BDBM50130531
NameBDBM50130531
Synonyms:CHEMBL3632691
TypeSmall organic molecule
Emp. Form.C23H25F3N2O3
Mol. Mass.434.4514
SMILESOC(COc1cccc(c1)C(F)(F)F)CN1CCC(CC1)N1Cc2ccccc2C1=O