Reaction Details
TargetSodium channel protein type 9 subunit alpha
LigandBDBM50130532
Substrate/Competitorn/a
Meas. Tech.ChEMBL_1525511 (CHEMBL3636864)
IC50 500±n/a nM
Citation Suzuki, SKuroda, TKimoto, HDomon, YKubota, KKitano, YYokoyama, TShimizugawa, ASugita, RKoishi, RAsano, DTamaki, KShinozuka, TKobayashi, H Discovery of (phenoxy-2-hydroxypropyl)piperidines as a novel class of voltage-gated sodium channel 1.7 inhibitors. Bioorg Med Chem Lett25:5419-23 (2015) 
 
Sodium channel protein type 9 subunit alpha
Name:Sodium channel protein type 9 subunit alpha
Type:Protein
Mol. Mass.:226375.97
Organism:Homo sapiens (Human)
Description:Q15858
Residue:1988
BDBM50130532
NameBDBM50130532
Synonyms:CHEMBL3632692
TypeSmall organic molecule
Emp. Form.C23H25F3N2O3
Mol. Mass.434.4514
SMILESOC(COc1ccc(cc1)C(F)(F)F)CN1CCC(CC1)N1Cc2ccccc2C1=O