Reaction Details
TargetSodium channel protein type 5 subunit alpha
LigandBDBM50130536
Substrate/Competitorn/a
Meas. Tech.ChEMBL_1525513 (CHEMBL3636866)
IC50 1100±n/a nM
Citation Suzuki, SKuroda, TKimoto, HDomon, YKubota, KKitano, YYokoyama, TShimizugawa, ASugita, RKoishi, RAsano, DTamaki, KShinozuka, TKobayashi, H Discovery of (phenoxy-2-hydroxypropyl)piperidines as a novel class of voltage-gated sodium channel 1.7 inhibitors. Bioorg Med Chem Lett25:5419-23 (2015) 
 
Sodium channel protein type 5 subunit alpha
Name:Sodium channel protein type 5 subunit alpha
Type:Enzyme
Mol. Mass.:226908.60
Organism:Homo sapiens (Human)
Description:Q14524
Residue:2016
BDBM50130536
NameBDBM50130536
Synonyms:CHEMBL3632696
TypeSmall organic molecule
Emp. Form.C22H25F3N2O3
Mol. Mass.422.4407
SMILESOC(COc1ccc(cc1)C(F)(F)F)CN1CCC(CC1)NC(=O)c1ccccc1