Reaction Details
TargetSodium channel protein type 9 subunit alpha
LigandBDBM50117271
Substrate/Competitorn/a
Meas. Tech.ChEMBL_1525514 (CHEMBL3636867)
IC50 11000±n/a nM
Citation Suzuki, SKuroda, TKimoto, HDomon, YKubota, KKitano, YYokoyama, TShimizugawa, ASugita, RKoishi, RAsano, DTamaki, KShinozuka, TKobayashi, H Discovery of (phenoxy-2-hydroxypropyl)piperidines as a novel class of voltage-gated sodium channel 1.7 inhibitors. Bioorg Med Chem Lett25:5419-23 (2015) 
 
Sodium channel protein type 9 subunit alpha
Name:Sodium channel protein type 9 subunit alpha
Type:PROTEIN
Mol. Mass.:225808.99
Organism:Mus musculus
Description:ChEMBL_109594
Residue:1984
BDBM50117271
NameBDBM50117271
Synonyms:1-(2,6-dimethylphenoxy)-2-propanolamine 2-(2,6-Dimethyl-phenoxy)-1-methyl-ethylamine CHEMBL558 Mexitil
TypeSmall organic molecule
Emp. Form.C11H17NO
Mol. Mass.179.2588
SMILESCC(N)COc1c(C)cccc1C