Reaction Details
TargetSodium channel protein type 9 subunit alpha
LigandBDBM50130512
Substrate/Competitorn/a
Meas. Tech.ChEMBL_1525514 (CHEMBL3636867)
IC50 2100±n/a nM
Citation Suzuki, SKuroda, TKimoto, HDomon, YKubota, KKitano, YYokoyama, TShimizugawa, ASugita, RKoishi, RAsano, DTamaki, KShinozuka, TKobayashi, H Discovery of (phenoxy-2-hydroxypropyl)piperidines as a novel class of voltage-gated sodium channel 1.7 inhibitors. Bioorg Med Chem Lett25:5419-23 (2015) 
 
Sodium channel protein type 9 subunit alpha
Name:Sodium channel protein type 9 subunit alpha
Type:PROTEIN
Mol. Mass.:225808.99
Organism:Mus musculus
Description:ChEMBL_109594
Residue:1984
BDBM50130512
NameBDBM50130512
Synonyms:CHEMBL3634322
TypeSmall organic molecule
Emp. Form.C29H30N2O5
Mol. Mass.486.5589
SMILESOC(COc1ccccc1C(=O)c1ccccc1)CN1CCC(CC1)c1cccc2NC(=O)COc12