Reaction Details
TargetSodium channel protein type 9 subunit alpha
LigandBDBM50130510
Substrate/Competitorn/a
Meas. Tech.ChEMBL_1525514 (CHEMBL3636867)
IC50 1300±n/a nM
Citation Suzuki, SKuroda, TKimoto, HDomon, YKubota, KKitano, YYokoyama, TShimizugawa, ASugita, RKoishi, RAsano, DTamaki, KShinozuka, TKobayashi, H Discovery of (phenoxy-2-hydroxypropyl)piperidines as a novel class of voltage-gated sodium channel 1.7 inhibitors. Bioorg Med Chem Lett25:5419-23 (2015) 
 
Sodium channel protein type 9 subunit alpha
Name:Sodium channel protein type 9 subunit alpha
Type:PROTEIN
Mol. Mass.:225808.99
Organism:Mus musculus
Description:ChEMBL_109594
Residue:1984
BDBM50130510
NameBDBM50130510
Synonyms:CHEMBL3632698
TypeSmall organic molecule
Emp. Form.C24H29F3N2O4
Mol. Mass.466.4933
SMILESCOc1cc(ccc1COCC(O)CN1CCC(CC1)C(=O)Nc1ccccc1)C(F)(F)F