Reaction Details
TargetSodium channel protein type 1 subunit alpha [1489-1708]
LigandBDBM50130527
Substrate/Competitorn/a
Meas. Tech.ChEMBL_1525517 (CHEMBL3636870)
IC50 34000±n/a nM
Citation Suzuki, SKuroda, TKimoto, HDomon, YKubota, KKitano, YYokoyama, TShimizugawa, ASugita, RKoishi, RAsano, DTamaki, KShinozuka, TKobayashi, H Discovery of (phenoxy-2-hydroxypropyl)piperidines as a novel class of voltage-gated sodium channel 1.7 inhibitors. Bioorg Med Chem Lett25:5419-23 (2015) 
 
Sodium channel protein type 1 subunit alpha [1489-1708]
Name:Sodium channel protein type 1 subunit alpha [1489-1708]
Type:PROTEIN
Mol. Mass.:25514.04
Organism:Mus musculus
Description:ChEMBL_109872
Residue:220
BDBM50130527
NameBDBM50130527
Synonyms:CHEMBL3634334
TypeSmall organic molecule
Emp. Form.C23H28N2O4
Mol. Mass.396.4794
SMILESCOc1ccccc1OCC(O)CN1CCC(CC1)N1Cc2ccccc2C1=O