Reaction Details
TargetSodium channel protein type 9 subunit alpha
LigandBDBM50130511
Substrate/Competitorn/a
Meas. Tech.ChEMBL_1525511 (CHEMBL3636864)
IC50 3900±n/a nM
Citation Suzuki, SKuroda, TKimoto, HDomon, YKubota, KKitano, YYokoyama, TShimizugawa, ASugita, RKoishi, RAsano, DTamaki, KShinozuka, TKobayashi, H Discovery of (phenoxy-2-hydroxypropyl)piperidines as a novel class of voltage-gated sodium channel 1.7 inhibitors. Bioorg Med Chem Lett25:5419-23 (2015) 
 
Sodium channel protein type 9 subunit alpha
Name:Sodium channel protein type 9 subunit alpha
Type:Protein
Mol. Mass.:226375.97
Organism:Homo sapiens (Human)
Description:Q15858
Residue:1988
BDBM50130511
NameBDBM50130511
Synonyms:CHEMBL3634321
TypeSmall organic molecule
Emp. Form.C28H29N3O5
Mol. Mass.487.547
SMILESOC(COc1ccccc1C(=O)c1ccccc1)CN1CCN(CC1)c1cccc2NC(=O)COc12