Reaction Details
TargetSodium channel protein type 9 subunit alpha
LigandBDBM50130512
Substrate/Competitorn/a
Meas. Tech.ChEMBL_1525511 (CHEMBL3636864)
IC50 780±n/a nM
Citation Suzuki, SKuroda, TKimoto, HDomon, YKubota, KKitano, YYokoyama, TShimizugawa, ASugita, RKoishi, RAsano, DTamaki, KShinozuka, TKobayashi, H Discovery of (phenoxy-2-hydroxypropyl)piperidines as a novel class of voltage-gated sodium channel 1.7 inhibitors. Bioorg Med Chem Lett25:5419-23 (2015) 
 
Sodium channel protein type 9 subunit alpha
Name:Sodium channel protein type 9 subunit alpha
Type:Protein
Mol. Mass.:226375.97
Organism:Homo sapiens (Human)
Description:Q15858
Residue:1988
BDBM50130512
NameBDBM50130512
Synonyms:CHEMBL3634322
TypeSmall organic molecule
Emp. Form.C29H30N2O5
Mol. Mass.486.5589
SMILESOC(COc1ccccc1C(=O)c1ccccc1)CN1CCC(CC1)c1cccc2NC(=O)COc12