Reaction Details
TargetMAP kinase-interacting serine/threonine-protein kinase 2
LigandBDBM50130696
Substrate/Competitorn/a
Meas. Tech.ChEMBL_1527068 (CHEMBL3637759)
Ki>10000±n/a nM
Citation Teo, TYang, YYu, MBasnet, SKGillam, THou, JSchmid, RMKumarasiri, MDiab, SAlbrecht, HSykes, MJWang, S An integrated approach for discovery of highly potent and selective Mnk inhibitors: Screening, synthesis and SAR analysis. Eur J Med Chem103:539-50 (2015) 
 
MAP kinase-interacting serine/threonine-protein kinase 2
Name:MAP kinase-interacting serine/threonine-protein kinase 2
Type:Protein
Mol. Mass.:51870.79
Organism:Homo sapiens (Human)
Description:Q9HBH9
Residue:465
BDBM50130696
NameBDBM50130696
Synonyms:CHEMBL3632738
TypeSmall organic molecule
Emp. Form.C16H14FN3O2S
Mol. Mass.331.365
SMILESCOC(=O)c1sc2ncnc(Nc3ccc(F)cc3C)c2c1C