Reaction Details
TargetCyclin-T1/Cyclin-dependent kinase 9
LigandBDBM98036
Substrate/Competitorn/a
Meas. Tech.ChEMBL_1527070 (CHEMBL3637761)
Ki>10000±n/a nM
Citation Teo, TYang, YYu, MBasnet, SKGillam, THou, JSchmid, RMKumarasiri, MDiab, SAlbrecht, HSykes, MJWang, S An integrated approach for discovery of highly potent and selective Mnk inhibitors: Screening, synthesis and SAR analysis. Eur J Med Chem103:539-50 (2015) 
 
Cyclin-T1/Cyclin-dependent kinase 9
Name:Cyclin-T1/Cyclin-dependent kinase 9
Type:Protein Complex
Mol. Mass.:n/a
Description:n/a
Components:This complex has 2 components.
Component 1
Name:Cyclin-T1
Synonyms:CCNT1 CycT Cyclin T Cyclin-T
Type:Enzyme Subunit
Mol. Mass.:80712.40
Organism:Homo sapiens (Human)
Description:n/a
Residue:726
Component 2
Name:Cyclin-dependent kinase 9
Synonyms:C-2K CDK9 Cell division cycle 2-like protein kinase 4 Cyclin-Dependent Kinase 9 (CDK9) Serine/threonine-protein kinase PITALRE Tat-associated kinase complex catalytic subunit
Type:Enzyme Subunit
Mol. Mass.:42789.13
Organism:Homo sapiens (Human)
Description:n/a
Residue:372
BDBM98036
NameBDBM98036
Synonyms:US8486953, 19
TypeSmall organic molecule
Emp. Form.C18H18FN3O3S
Mol. Mass.375.417
SMILESCOC(=O)c1sc2ncnc(Nc3ccc(F)cc3OC(C)C)c2c1C