Reaction Details
TargetMAP kinase-interacting serine/threonine-protein kinase 1
LigandBDBM50130693
Substrate/Competitorn/a
Meas. Tech.ChEMBL_1527074 (CHEMBL3637765)
Ki 1010±n/a nM
Citation Teo, TYang, YYu, MBasnet, SKGillam, THou, JSchmid, RMKumarasiri, MDiab, SAlbrecht, HSykes, MJWang, S An integrated approach for discovery of highly potent and selective Mnk inhibitors: Screening, synthesis and SAR analysis. Eur J Med Chem103:539-50 (2015) 
 
MAP kinase-interacting serine/threonine-protein kinase 1
Name:MAP kinase-interacting serine/threonine-protein kinase 1
Type:Serine/threonine-protein kinase
Mol. Mass.:51342.85
Organism:Homo sapiens (Human)
Description:Q9BUB5
Residue:465
BDBM50130693
NameBDBM50130693
Synonyms:CGP-57380 | CHEMBL1240885
TypeSmall organic molecule
Emp. Form.C11H9FN6
Mol. Mass.244.2278
SMILESNc1ncnc2[nH]nc(Nc3ccc(F)cc3)c12