Reaction Details
TargetNuclear receptor subfamily 1 group I member 2
LigandBDBM50130718
Substrate/Competitorn/a
Meas. Tech.ChEMBL_1527084 (CHEMBL3635224)
IC50 27400±n/a nM
Citation Hodnik, ?Toma?ic, TSmodi?, DD'Amore, CMa?ic, LPFiorucci, SKikelj, D Diethylstilbestrol-scaffold-based pregnane X receptor modulators. Eur J Med Chem103:551-62 (2015) 
 
Nuclear receptor subfamily 1 group I member 2
Name:Nuclear receptor subfamily 1 group I member 2
Type:Nuclear receptor
Mol. Mass.:49774.77
Organism:Homo sapiens (Human)
Description:O75469
Residue:434
BDBM50130718
NameBDBM50130718
Synonyms:CHEMBL3632924
TypeSmall organic molecule
Emp. Form.C22H28O4
Mol. Mass.356.4553
SMILESCC\C(=C(\CC)c1ccc(OCCO)cc1)c1ccc(OCCO)cc1