Reaction Details
TargetCarbonic anhydrase 9
LigandBDBM50130738
Substrate/Competitorn/a
Meas. Tech.ChEMBL_1524849 (CHEMBL3636831)
Ki 14±n/a nM
Citation Ibrahim, HSAbou-Seri, SMTanc, MElaasser, MMAbdel-Aziz, HASupuran, CT Isatin-pyrazole benzenesulfonamide hybrids potently inhibit tumor-associated carbonic anhydrase isoforms IX and XII. Eur J Med Chem103:583-93 (2015) 
 
Carbonic anhydrase 9
Name:Carbonic anhydrase 9
Type:Enzyme
Mol. Mass.:49669.03
Organism:Homo sapiens (Human)
Description:Catalytic domain of human cloned isozyme was used in the assay
Residue:459
BDBM50130738
NameBDBM50130738
Synonyms:CHEMBL3633548
TypeSmall organic molecule
Emp. Form.C31H24N6O4S
Mol. Mass.576.625
SMILESNS(=O)(=O)c1ccc(cc1)-n1ncc(C(=O)N\N=C2/C(=O)N(Cc3ccccc3)c3ccccc23)c1-c1ccccc1