Reaction Details
TargetCarbonic anhydrase 1
LigandBDBM50130752
Substrate/Competitorn/a
Meas. Tech.ChEMBL_1524847 (CHEMBL3636829)
Ki 38±n/a nM
Citation Ibrahim, HSAbou-Seri, SMTanc, MElaasser, MMAbdel-Aziz, HASupuran, CT Isatin-pyrazole benzenesulfonamide hybrids potently inhibit tumor-associated carbonic anhydrase isoforms IX and XII. Eur J Med Chem103:583-93 (2015) 
 
Carbonic anhydrase 1
Name:Carbonic anhydrase 1
Type:Enzyme
Mol. Mass.:28873.37
Organism:Homo sapiens (Human)
Description:P00915
Residue:261
BDBM50130752
NameBDBM50130752
Synonyms:CHEMBL3633384
TypeSmall organic molecule
Emp. Form.C24H17ClN6O4S
Mol. Mass.520.948
SMILESNS(=O)(=O)c1ccc(cc1)-n1ncc(C(=O)N\N=C2/C(=O)Nc3ccc(Cl)cc23)c1-c1ccccc1