Reaction Details
TargetCarbonic anhydrase 1
LigandBDBM50130739
Substrate/Competitorn/a
Meas. Tech.ChEMBL_1524847 (CHEMBL3636829)
Ki 5.7±n/a nM
Citation Ibrahim, HSAbou-Seri, SMTanc, MElaasser, MMAbdel-Aziz, HASupuran, CT Isatin-pyrazole benzenesulfonamide hybrids potently inhibit tumor-associated carbonic anhydrase isoforms IX and XII. Eur J Med Chem103:583-93 (2015) 
 
Carbonic anhydrase 1
Name:Carbonic anhydrase 1
Type:Enzyme
Mol. Mass.:28873.37
Organism:Homo sapiens (Human)
Description:P00915
Residue:261
BDBM50130739
NameBDBM50130739
Synonyms:CHEMBL3633549
TypeSmall organic molecule
Emp. Form.C18H15N7O4S
Mol. Mass.425.421
SMILESNc1c(cnn1-c1ccc(cc1)S(N)(=O)=O)C(=O)N\N=C1/C(=O)Nc2ccccc12