Reaction Details
TargetCarbonic anhydrase 2
LigandBDBM50130747
Substrate/Competitorn/a
Meas. Tech.ChEMBL_1524848 (CHEMBL3636830)
Ki 12±n/a nM
Citation Ibrahim, HSAbou-Seri, SMTanc, MElaasser, MMAbdel-Aziz, HASupuran, CT Isatin-pyrazole benzenesulfonamide hybrids potently inhibit tumor-associated carbonic anhydrase isoforms IX and XII. Eur J Med Chem103:583-93 (2015) 
 
Carbonic anhydrase 2
Name:Carbonic anhydrase 2
Type:Enzyme
Mol. Mass.:29250.71
Organism:Homo sapiens (Human)
Description:P00918
Residue:260
BDBM50130747
NameBDBM50130747
Synonyms:CHEMBL3633379
TypeSmall organic molecule
Emp. Form.C24H18N6O4S
Mol. Mass.486.503
SMILESNS(=O)(=O)c1ccc(cc1)-n1nc(cc1-c1ccccc1)C(=O)N\N=C1/C(=O)Nc2ccccc12