Reaction Details
TargetKappa-type opioid receptor
LigandBDBM50325534
Substrate/Competitorn/a
Meas. Tech.ChEMBL_1525041 (CHEMBL3637639)
EC50 0.034000±n/a nM
Citation Molenveld, PBouzanne des Mazery, RSterk, GJStorcken, RPAutar, Rvan Oss, Bvan der Haas, RNFröhlich, RSchepmann, DWünsch, BSoeberdt, M Conformationally restricted¿-opioid receptor agonists: Synthesis and pharmacological evaluation of diastereoisomeric and enantiomeric decahydroquinoxalines. Bioorg Med Chem Lett25:5326-30 (2015) 
 
Kappa-type opioid receptor
Name:Kappa-type opioid receptor
Type:G Protein-Coupled Receptor (GPCR)
Mol. Mass.:42648.76
Organism:Homo sapiens (Human)
Description:P41145
Residue:380
BDBM50325534
NameBDBM50325534
Synonyms:CHEMBL267495 | nalfurafine
TypeSmall organic molecule
Emp. Form.C28H32N2O5
Mol. Mass.476.5641
SMILESCN([C@@H]1CC[C@@]2(O)[C@H]3Cc4ccc(O)c5O[C@@H]1[C@]2(CCN3CC1CC1)c45)C(=O)\C=C\c1ccoc1