Reaction Details
TargetcAMP and cAMP-inhibited cGMP 3',5'-cyclic phosphodiesterase 10A
LigandBDBM50130761
Substrate/Competitorn/a
Meas. Tech.ChEMBL_1525203 (CHEMBL3635514)
IC50 0.540000±n/a nM
Citation Lingam, VSDahale, DHRathi, VEShingote, YBThakur, RRMindhe, ASKummari, SKhairatkar-Joshi, NBajpai, MShah, DMSapalya, RSGullapalli, SGupta, PKGudi, GSJadhav, SBPattem, RThomas, A Design, Synthesis, and Pharmacological Evaluation of 5,6-Disubstituted Pyridin-2(1H)-one Derivatives as Phosphodiesterase 10A (PDE10A) Antagonists. J Med Chem58:8292-308 (2015) 
 
cAMP and cAMP-inhibited cGMP 3',5'-cyclic phosphodiesterase 10A
Name:cAMP and cAMP-inhibited cGMP 3',5'-cyclic phosphodiesterase 10A
Type:Protein
Mol. Mass.:88412.52
Organism:Homo sapiens (Human)
Description:Q9Y233
Residue:779
BDBM50130761
NameBDBM50130761
Synonyms:CHEMBL3634856
TypeSmall organic molecule
Emp. Form.C24H18N4O2
Mol. Mass.394.4253
SMILESO=c1ccc(-c2ccc(OCc3ccc4[nH]ccc4n3)cc2)c([nH]1)-c1ccncc1