Reaction Details
TargetcAMP and cAMP-inhibited cGMP 3',5'-cyclic phosphodiesterase 10A
LigandBDBM50130849
Substrate/Competitorn/a
Meas. Tech.ChEMBL_1525203 (CHEMBL3635514)
IC50 1.1±n/a nM
Citation Lingam, VSDahale, DHRathi, VEShingote, YBThakur, RRMindhe, ASKummari, SKhairatkar-Joshi, NBajpai, MShah, DMSapalya, RSGullapalli, SGupta, PKGudi, GSJadhav, SBPattem, RThomas, A Design, Synthesis, and Pharmacological Evaluation of 5,6-Disubstituted Pyridin-2(1H)-one Derivatives as Phosphodiesterase 10A (PDE10A) Antagonists. J Med Chem58:8292-308 (2015) 
 
cAMP and cAMP-inhibited cGMP 3',5'-cyclic phosphodiesterase 10A
Name:cAMP and cAMP-inhibited cGMP 3',5'-cyclic phosphodiesterase 10A
Type:Protein
Mol. Mass.:88412.52
Organism:Homo sapiens (Human)
Description:Q9Y233
Residue:779
BDBM50130849
NameBDBM50130849
Synonyms:CHEMBL3634744
TypeSmall organic molecule
Emp. Form.C27H20N2O2
Mol. Mass.404.4599
SMILESO=c1ccc(-c2ccc(OCc3ccc4ccccc4n3)cc2)c([nH]1)-c1ccccc1