Reaction Details
TargetSuppressor of tumorigenicity 14 protein
LigandBDBM50130870
Substrate/Competitorn/a
Meas. Tech.ChEMBL_1525566 (CHEMBL3637192)
Ki 2100±n/a nM
Citation Goswami, RWohlfahrt, GTörmäkangas, OMoilanen, ALakshminarasimhan, ANagaraj, JArumugam, KNMukherjee, SChacko, ARKrishnamurthy, NRJaleel, MPalakurthy, RKSamiulla, DSRamachandra, M Structure-guided discovery of 2-aryl/pyridin-2-yl-1H-indole derivatives as potent and selective hepsin inhibitors. Bioorg Med Chem Lett25:5309-14 (2015) 
 
Suppressor of tumorigenicity 14 protein
Name:Suppressor of tumorigenicity 14 protein
Type:Single-pass type II membrane protein
Mol. Mass.:94769.23
Organism:Homo sapiens (Human)
Description:Q9Y5Y6
Residue:855
BDBM50130870
NameBDBM50130870
Synonyms:CHEMBL3632759
TypeSmall organic molecule
Emp. Form.C20H22N4O
Mol. Mass.334.4149
SMILESNC(=N)c1ccc2[nH]c(cc2c1)-c1cccc(n1)C1(O)CCCCC1