Reaction Details
TargetUrokinase-type plasminogen activator
LigandBDBM50102768
Substrate/Competitorn/a
Meas. Tech.ChEMBL_1525567 (CHEMBL3637193)
Ki 2400±n/a nM
Citation Goswami, RWohlfahrt, GTörmäkangas, OMoilanen, ALakshminarasimhan, ANagaraj, JArumugam, KNMukherjee, SChacko, ARKrishnamurthy, NRJaleel, MPalakurthy, RKSamiulla, DSRamachandra, M Structure-guided discovery of 2-aryl/pyridin-2-yl-1H-indole derivatives as potent and selective hepsin inhibitors. Bioorg Med Chem Lett25:5309-14 (2015) 
 
Urokinase-type plasminogen activator
Name:Urokinase-type plasminogen activator
Type:Enzyme
Mol. Mass.:48528.62
Organism:Homo sapiens (Human)
Description:P00749
Residue:431
BDBM50102768
NameBDBM50102768
Synonyms:2-(2-Hydroxy-phenyl)-1H-indole-5-carboxamidine | CHEMBL284805
TypeSmall organic molecule
Emp. Form.C15H13N3O
Mol. Mass.251.2832
SMILESNC(=N)c1ccc2[nH]c(cc2c1)-c1ccccc1O