Reaction Details
TargetGlutamate receptor ionotropic, NMDA 1/2A
LigandBDBM50130937
Substrate/Competitorn/a
Meas. Tech.ChEMBL_1526086 (CHEMBL3636333)
Ki 19±n/a nM
Citation Bonifazi, ADel Bello, FMammoli, VPiergentili, APetrelli, RCimarelli, CPellei, MSchepmann, DWünsch, BBarocelli, EBertoni, SFlammini, LAmantini, CNabissi, MSantoni, GVistoli, GQuaglia, W Novel Potent N-Methyl-d-aspartate (NMDA) Receptor Antagonists ors1 Receptor Ligands Based on Properly Substituted 1,4-Dioxane Ring. J Med Chem58:8601-15 (2015) 
 
Glutamate receptor ionotropic, NMDA 1/2A
Name:Glutamate receptor ionotropic, NMDA 1/2A
Type:Protein
Mol. Mass.:n/a
Description:n/a
Components:This complex has 2 components.
Component 1
Name:Glutamate receptor ionotropic, NMDA 1
Synonyms:GRIN1 Glutamate [NMDA] receptor subunit zeta-1 N-methyl-D-aspartate receptor subunit NR1 NMDZ1_HUMAN | phencyclidine
Type:Enzyme Catalytic Domain
Mol. Mass.:105397.81
Organism:Homo sapiens (Human)
Description:Q05586
Residue:938
Component 2
Name:Glutamate receptor ionotropic, NMDA 2A
Synonyms:GRIN2A Glutamate [NMDA] receptor Glutamate [NMDA] receptor subunit epsilon-1 NMDA receptor subtype 2A protein (NR2A) NMDE1_HUMAN hNR2A
Type:n/a
Mol. Mass.:165293.76
Organism:Homo sapiens (Human)
Description:n/a
Residue:1464
BDBM50130937
NameBDBM50130937
Synonyms:Dexoxadrol | Dioxadrol
TypeSmall organic molecule
Emp. Form.C20H23NO2
Mol. Mass.309.4021
SMILES[H][C@@]1(COC(O1)(c1ccccc1)c1ccccc1)[C@]1([H])CCCCN1