Reaction Details
TargetP2Y purinoceptor 11
LigandBDBM50366480
Substrate/Competitorn/a
Meas. Tech.ChEBML_1526465
EC50 6700±n/a nM
Citation Azran, SDanino, OFörster, DKenigsberg, SReiser, GDixit, MSingh, VMajor, DTFischer, B Identification of Highly Promising Antioxidants/Neuroprotectants Based on Nucleoside 5'-Phosphorothioate Scaffold. Synthesis, Activity, and Mechanisms of Action. J Med Chem58:8427-43 (2015) 
 
P2Y purinoceptor 11
Name:P2Y purinoceptor 11
Type:PROTEIN
Mol. Mass.:40366.02
Organism:Homo sapiens (Human)
Description:ChEMBL_1362532
Residue:374
BDBM50366480
NameBDBM50366480
Synonyms:ADENOSINE TRIPHOSPHATE | ATP
TypeSmall organic molecule
Emp. Form.C10H16N5O13P3
Mol. Mass.507.181
SMILESNc1ncnc2n(cnc12)[C@@H]1O[C@H](CO[P@](O)(=O)O[P@@](O)(=O)OP(O)(O)=O)[C@@H](O)[C@H]1O