Reaction Details
TargetP2Y purinoceptor 11
LigandBDBM50131063
Substrate/Competitorn/a
Meas. Tech.ChEBML_1526465
EC50 500±n/a nM
Citation Azran, SDanino, OFörster, DKenigsberg, SReiser, GDixit, MSingh, VMajor, DTFischer, B Identification of Highly Promising Antioxidants/Neuroprotectants Based on Nucleoside 5'-Phosphorothioate Scaffold. Synthesis, Activity, and Mechanisms of Action. J Med Chem58:8427-43 (2015) 
 
P2Y purinoceptor 11
Name:P2Y purinoceptor 11
Type:PROTEIN
Mol. Mass.:40366.02
Organism:Homo sapiens (Human)
Description:ChEMBL_1362532
Residue:374
BDBM50131063
NameBDBM50131063
Synonyms:CHEMBL3634183
TypeSmall organic molecule
Emp. Form.C10H14ClN5O9P2S
Mol. Mass.477.712
SMILESNc1nc(Cl)nc2n(cnc12)[C@@H]1O[C@H](COP(S)(=O)OP(O)(O)=O)[C@@H](O)[C@H]1O