Reaction Details
TargetSerine/threonine-protein kinase pim-2
LigandBDBM50131278
Substrate/Competitorn/a
Meas. Tech.ChEBML_1526829
Ki 0.088000±n/a nM
Citation Hu, HWang, XChan, GKChang, JHDo, SDrummond, JEbens, ALee, WLy, JLyssikatos, JPMurray, JMoffat, JGChao, QTsui, VWallweber, HKolesnikov, A Discovery of 3,5-substituted 6-azaindazoles as potent pan-Pim inhibitors. Bioorg Med Chem Lett25:5258-64 (2015) 
 
Serine/threonine-protein kinase pim-2
Name:Serine/threonine-protein kinase pim-2
Type:Serine/threonine-protein kinase
Mol. Mass.:34185.93
Organism:Homo sapiens (Human)
Description:Q9P1W9
Residue:311
BDBM50131278
NameBDBM50131278
Synonyms:CHEMBL3634760 | US9260425, 433
TypeSmall organic molecule
Emp. Form.C21H24N8
Mol. Mass.388.4689
SMILESCc1ccc(nc1N1CCC[C@H](N)C1)-c1n[nH]c2cnc(cc12)-c1cnn(C)c1