Reaction Details
TargetSerine/threonine-protein kinase pim-3
LigandBDBM50131228
Substrate/Competitorn/a
Meas. Tech.ChEBML_1526830
Ki 0.016000±n/a nM
Citation Hu, HWang, XChan, GKChang, JHDo, SDrummond, JEbens, ALee, WLy, JLyssikatos, JPMurray, JMoffat, JGChao, QTsui, VWallweber, HKolesnikov, A Discovery of 3,5-substituted 6-azaindazoles as potent pan-Pim inhibitors. Bioorg Med Chem Lett25:5258-64 (2015) 
 
Serine/threonine-protein kinase pim-3
Name:Serine/threonine-protein kinase pim-3
Type:Protein
Mol. Mass.:35888.19
Organism:Homo sapiens (Human)
Description:Q86V86
Residue:326
BDBM50131228
NameBDBM50131228
Synonyms:CHEMBL3634772 | US9260425, 497
TypeSmall organic molecule
Emp. Form.C22H24N8
Mol. Mass.400.4796
SMILESC(C1CC1)n1cc(cn1)-c1cc2c(n[nH]c2cn1)-c1cccc(n1)N1CCNCC1