Reaction Details
TargetSerine/threonine-protein kinase pim-1
LigandBDBM50131376
Substrate/Competitorn/a
Meas. Tech.ChEBML_1526828
Ki 0.300000±n/a nM
Citation Hu, HWang, XChan, GKChang, JHDo, SDrummond, JEbens, ALee, WLy, JLyssikatos, JPMurray, JMoffat, JGChao, QTsui, VWallweber, HKolesnikov, A Discovery of 3,5-substituted 6-azaindazoles as potent pan-Pim inhibitors. Bioorg Med Chem Lett25:5258-64 (2015) 
 
Serine/threonine-protein kinase pim-1
Name:Serine/threonine-protein kinase pim-1
Type:Protein
Mol. Mass.:35681.82
Organism:Homo sapiens (Human)
Description:P11309
Residue:313
BDBM50131376
NameBDBM50131376
Synonyms:CHEMBL3634780 | US9260425, 143
TypeSmall organic molecule
Emp. Form.C18H17N7
Mol. Mass.331.3745
SMILESNCCNc1cccc(n1)-c1n[nH]c2cnc(cc12)-c1cccnc1