Reaction Details
TargetSerine/threonine-protein kinase pim-1
LigandBDBM50131378
Substrate/Competitorn/a
Meas. Tech.ChEBML_1526828
Ki 0.041000±n/a nM
Citation Hu, HWang, XChan, GKChang, JHDo, SDrummond, JEbens, ALee, WLy, JLyssikatos, JPMurray, JMoffat, JGChao, QTsui, VWallweber, HKolesnikov, A Discovery of 3,5-substituted 6-azaindazoles as potent pan-Pim inhibitors. Bioorg Med Chem Lett25:5258-64 (2015) 
 
Serine/threonine-protein kinase pim-1
Name:Serine/threonine-protein kinase pim-1
Type:Protein
Mol. Mass.:35681.82
Organism:Homo sapiens (Human)
Description:P11309
Residue:313
BDBM50131378
NameBDBM50131378
Synonyms:CHEMBL3634782 | US9260425, 384
TypeSmall organic molecule
Emp. Form.C21H21N7
Mol. Mass.371.4383
SMILESCc1cncc(c1)-c1cc2c(n[nH]c2cn1)-c1cccc(n1)N1CCNCC1