Reaction Details
TargetTranslocator protein
LigandBDBM50131399
Substrate/Competitorn/a
Meas. Tech.ChEMBL_1526857 (CHEMBL3636925)
Ki 398±n/a nM
Citation Narlawar, RWerry, ELScarf, AMHanani, RChua, SWKing, VABarron, MLMartins, RNIttner, LMRendina, LMKassiou, M First Demonstration of Positive Allosteric-like Modulation at the Human Wild Type Translocator Protein (TSPO). J Med Chem58:8743-9 (2015) 
 
Translocator protein
Name:Translocator protein
Type:Enzyme
Mol. Mass.:18834.74
Organism:Homo sapiens (Human)
Description:P30536
Residue:169
BDBM50131399
NameBDBM50131399
Synonyms:CHEMBL3634877
TypeSmall organic molecule
Emp. Form.C22H27N3O2
Mol. Mass.365.4687
SMILESCCN(CC)C(=O)Cn1c(nc2c(C)cc(C)cc12)-c1ccc(OC)cc1